私有化部署编译失败
Mereone 发布于2020-11 浏览:1332 回复:1
0
收藏

图像分类私有化部署(服务器端SDK - Linux SDK集成 C++)

在执行部署的过程中编译失败,错误信息为:

make[2]: *** [easyedge_demo] 错误 1
make[1]: *** [CMakeFiles/easyedge_demo.dir/all] 错误 2
make: *** [all] 错误 2

请问是什么原因造成的呢?

收藏
点赞
0
个赞
共1条回复 最后由a18571138864回复于2022-07
#2深圳九曲范深回复于2020-11

这个最好是工单去问下了,另外也可以找商务处理。

0
TOP
切换版块